{"text_format":"1","workbook":"xlsx","n_sheets":8,"sheets":["Start here","Animal data","cow info","Feed Table","diet formulation","Ration Guidlines","lists to hide","diets with the feed analysi (2"],"not_rendered":{"charts":0,"images":1,"macros":1,"external_links":0,"defined_names":62,"comments":1,"pivot_tables":0},"unopened":[],"bounds":{"document_bytes":16777216,"sheet_cells":100000,"rows_first":2000,"rows_last":500,"rows_between":2000,"halvings":0,"cell_chars":16384,"cell_head_chars":4096},"cells_cut":0,"cells_raw":0,"read":"whole","date_system":"1900"}

{"sheet":"Start here","index":0,"n_rows":32,"n_cols":3,"rows_kept":32,"cut":false,"hidden":false,"merged":[[26,1,26,2]]}
[]
[]
[]
[]
[]
[]
[]
[]
[]
[]
{"$rows_left_out":23}
{"sheet":"Animal data","index":1,"n_rows":23,"n_cols":8,"rows_kept":23,"cut":false,"hidden":true,"merged":[]}
[]
["select animal Breed and Type"]
[null,"Breed","Holstein"]
[]
[null,"type","Lactating cow"]
[]
["Describe the Target Lactating cow",null,"//////","Animal Description"]
[]
["current Information",null,null,"Units"]
[null,"Cow stage","mid lactation cow",null,null,"age"]
{"$rows_left_out":14}
{"sheet":"cow info","index":2,"n_rows":28,"n_cols":11,"rows_kept":28,"cut":false,"hidden":false,"merged":[[2,1,2,3],[4,1,4,3]]}
[]
[null,null,null,null,null,null,null,null,null,"Cells where instructions can be found."]
[null,null,null,null,null,null,null,null,null,"Cells where you should enter numbers"]
[null,null,null,null,null,null,null,null,null,"Cells where calcuated values are displayed (Do not change)"]
[]
[]
[null,null,null,null,null,null,null,null,"Use this converter to change lbs to kg"]
[null,null,null,"Enter value here",null,"Do not change"]
[null,null,null,null,null,null,null,null,"Instructions:"]
[null,"COW CHARACTERISTICS:",null,"(Metric System)",null,"(Standard System)",null,null,"Change values in the blue cells ONLY"]
{"$rows_left_out":19}
{"sheet":"Feed Table","index":3,"n_rows":177,"n_cols":40,"rows_kept":177,"cut":false,"hidden":false,"merged":[]}
[]
[null,null,null,null,null,null,null,null,null,null,null,null,null,null,null,null,null,null,null,null,null,null,null,null,null,null,null,null,"CONVERTER",null,"$/ton",null,"$/lb",null,"$/lb","$/lb","$/kg",null,null,"Cells where instructions can be found."]
[null,null,null,null,null,null,null,null,null,null,null,null,null,null,null,null,null,null,null,null,null,null,null,null,null,null,null,null,null,null,"as fed","% DM","as fed",null,"as fed","DM","DM",null,null,"Cells where you should enter numbers"]
[null,null,null,null,null,null,null,null,null,null,null,null,null,null,null,null,null,null,null,null,null,null,null,null,null,null,null,null,"ROW A",null,85.66,71.8,null,null,{"$f":"AE4/2000","v":4.283E-2},{"$f":"(AE4/2000)/(AF4/100)","v":5.965181058495822E-2},{"$f":"2.2046226*((AE4/2000)/(AF4/100))","v":0.13150972974651812},null,null,"Cells where calcuated values are displayed (Do not change)"]
[null,null,null,null,null,null,null,null,null,null,null,null,null,null,null,null,null,null,null,null,null,null,null,null,null,null,null,null,"ROW B",null,null,33,2.3800000000000002E-2,null,null,{"$f":"AG5/(AF5/100)","v":7.2121212121212128E-2},{"$f":"2.2046226*AJ5","v":0.1590000541818182}]
[]
[]
[]
[]
[null,null,null,null,null,null,null,"Table 15.1: Nutrient Composition of some feedstuffs commonly fed to dairy cattle",null,null,null,null,null,null,null,null,null,null,null,null,"Table 15.2: N fraction, RUP digestibility, Lysine and Methionine",null,null,null,null,null,null,null,"Table 15.3: Mineral composition of some feedstuffs",null,null,null,null,null,"STARCH","PRICE","PRICE"]
{"$rows_left_out":168}
{"sheet":"diet formulation","index":4,"n_rows":40,"n_cols":35,"rows_kept":40,"cut":false,"hidden":false,"merged":[[23,33,23,34],[27,3,28,4],[22,2,22,34],[0,32,0,34],[0,1,0,30],[1,1,2,1],[1,10,2,10],[28,12,28,13],[1,8,2,8],[1,9,2,9],[29,7,31,10],[23,3,23,4],[24,3,24,4],[25,3,25,4],[23,12,23,14],[25,12,25,14],[27,12,27,13]]}
[null,"Feed Ingredients",null,null,null,null,null,null,null,null,null,null,null,null,null,null,null,null,null,null,null,null,null,null,null,null,null,null,null,null,null,null,"Costs"]
[null,"Enter feed number here",null,null,null,null,null,null,"Lower limit in Diet DM,  %","% in Diet DM","Higher Limit in Diet DM, %",null,null,"% \"as-is\"","% of the TMR","% of DM","% of DM","% of DM","% of DM","% of DM","% of CP","% of CP","% of CP","%/h",null,"%","% of DM","% of DM","% of DM","% of DM","% of DM",null,"$/Lbs of DM","$/day","$/kg of DM"]
[null,null,"Name","Description","Lower limit,\n Lbs of DM","Lbs of DM fed","Higher Limit,\n Lbs of DM","Kg of DM fed",null,null,null,null,"TDN eq. Cl.","DM","forage (DM basis)","CP","EE","NDF","Forage NDF","NFC","A","B","C","B Frc. Kd","B frc. Kp","RUP Dig","RDP","RUP","Ca","P","starch",null,"Feed Cost","Feed Cost in the TMR","Feed Cost"]
[null,null,2,3,null,null,null,null,null,null,null,null,4,6,null,7,10,11,null,15,19,20,21,22,null,23,null,null,26,27,33,null,34,34,35]
[null,null,{"$f":"IF($B5=\"\",\"\",INDEX('Feed Table'!$C$14:$AJ$177,MATCH(1,(List1[Entry]=$B5)*(List1[AVG-SD]=\"AVG\"),0),C$4))","v":""},{"$f":"IF($B5=\"\",\"\",INDEX('Feed Table'!$C$14:$AJ$177,MATCH(1,(List1[Entry]=$B5)*(List1[AVG-SD]=\"AVG\"),0),D$4))","v":""},{"$f":"IF(F5=\"\",\"\",I5/100*$F$25)","v":0},9.9999999999999995E-7,{"$f":"IF(F5=\"\",\"\",K5/100*$F$25)","v":9.9999999999999995E-7},{"$f":"IF(F5=\"\",\"\",CONVERT(F5,\"lbm\",\"kg\"))","v":4.5359237E-7},0,{"$f":"IF(OR(B5=\"\",F5=\"\"),0,F5/SUM($F$5:$F$21))","v":0},100,null,{"$f":"IF($B5=\"\",\"\",INDEX('Feed Table'!$C$14:$AJ$177,MATCH(1,(List1[Entry]=$B5)*(List1[AVG-SD]=\"AVG\"),0),M$4))","v":""},{"$f":"IF($B5=\"\",\"\",INDEX('Feed Table'!$C$14:$AJ$177,MATCH(1,(List1[Entry]=$B5)*(List1[AVG-SD]=\"AVG\"),0),N$4))","v":""},{"$f":"+IF(M5=\"forage\",J5,\"-\")","v":"-"},{"$f":"IF($B5=\"\",\"\",INDEX('Feed Table'!$C$14:$AJ$177,MATCH(1,(List1[Entry]=$B5)*(List1[AVG-SD]=\"AVG\"),0),P$4))","v":""},{"$f":"IF($B5=\"\",\"\",INDEX('Feed Table'!$C$14:$AJ$177,MATCH(1,(List1[Entry]=$B5)*(List1[AVG-SD]=\"AVG\"),0),Q$4))","v":""},{"$f":"IF($B5=\"\",\"\",INDEX('Feed Table'!$C$14:$AJ$177,MATCH(1,(List1[Entry]=$B5)*(List1[AVG-SD]=\"AVG\"),0),R$4))","v":""},{"$f":"IF(M5=\"Forage\",R5,\"\")","v":""},{"$f":"IF($B5=\"\",\"\",INDEX('Feed Table'!$C$14:$AJ$177,MATCH(1,(List1[Entry]=$B5)*(List1[AVG-SD]=\"AVG\"),0),T$4))","v":""},{"$f":"IF($B5=\"\",\"\",INDEX('Feed Table'!$C$14:$AJ$177,MATCH(1,(List1[Entry]=$B5)*(List1[AVG-SD]=\"AVG\"),0),U$4))","v":""},{"$f":"IF($B5=\"\",\"\",INDEX('Feed Table'!$C$14:$AJ$177,MATCH(1,(List1[Entry]=$B5)*(List1[AVG-SD]=\"AVG\"),0),V$4))","v":""},{"$f":"IF($B5=\"\",\"\",INDEX('Feed Table'!$C$14:$AJ$177,MATCH(1,(List1[Entry]=$B5)*(List1[AVG-SD]=\"AVG\"),0),W$4))","v":""},{"$f":"IF($B5=\"\",\"\",INDEX('Feed Table'!$C$14:$AJ$177,MATCH(1,(List1[Entry]=$B5)*(List1[AVG-SD]=\"AVG\"),0),X$4))","v":""},{"$f":"IF($B5=\"\",\"\",IF(AND(M5=\"Forage\",N5>=70),3.362+0.479*'lists to hide'!$E$14-0.007*(1-$O$25)-0.017*R5,IF(M5=\"Forage\",3.054+0.614*'lists to hide'!$E$14,IF(M5=\"Conc\",2.904+1.375*'lists to hide'!$E$14-0.02*(1-$O$25),0))))","v":""},{"$f":"IF($B5=\"\",\"\",INDEX('Feed Table'!$C$14:$AJ$177,MATCH(1,(List1[Entry]=$B5)*(List1[AVG-SD]=\"AVG\"),0),Z$4))","v":""},{"$f":"IF(M5=\"Minerals\",0,IF(M5=\"Minerals-wN\",P5,IF(Y5=\"\",\"\",(U5+V5*(X5/(X5+Y5)))*P5/100)))","v":""},{"$f":"IF(M5=\"minerals\",0,IF(M5=\"minerals-wN\",0,IF(Y5=\"\",\"\",(W5+V5*(Y5/(X5+Y5)))*P5/100)))","v":""},{"$f":"IF($B5=\"\",\"\",INDEX('Feed Table'!$C$14:$AJ$177,MATCH(1,(List1[Entry]=$B5)*(List1[AVG-SD]=\"AVG\"),0),AC$4))","v":""},{"$f":"IF($B5=\"\",\"\",INDEX('Feed Table'!$C$14:$AJ$177,MATCH(1,(List1[Entry]=$B5)*(List1[AVG-SD]=\"AVG\"),0),AD$4))","v":""},{"$f":"IF($B5=\"\",\"\",INDEX('Feed Table'!$C$14:$AJ$177,MATCH(1,(List1[Entry]=$B5)*(List1[AVG-SD]=\"AVG\"),0),AE$4))","v":""},null,{"$f":"IF($B5=\"\",\"\",INDEX('Feed Table'!$C$14:$AJ$177,MATCH(1,(List1[Entry]=$B5)*(List1[AVG-SD]=\"AVG\"),0),AG$4))","v":""},{"$f":"+IF(AG5=\"\",\"\",AG5*F5)","v":""},{"$f":"IF($B5=\"\",\"\",INDEX('Feed Table'!$C$14:$AK$177,MATCH(1,(List1[Entry]=$B5)*(List1[AVG-SD]=\"AVG\"),0),AI$4))","v":""}]
[null,null,{"$f":"IF($B6=\"\",\"\",INDEX('Feed Table'!$C$14:$AJ$177,MATCH(1,(List1[Entry]=$B6)*(List1[AVG-SD]=\"AVG\"),0),C$4))","v":""},{"$f":"IF($B6=\"\",\"\",INDEX('Feed Table'!$C$14:$AJ$177,MATCH(1,(List1[Entry]=$B6)*(List1[AVG-SD]=\"AVG\"),0),D$4))","v":""},0,0,9.9999999999999995E-7,{"$f":"IF(F6=\"\",\"\",CONVERT(F6,\"lbm\",\"kg\"))","v":0},0,0,100,null,{"$f":"IF($B6=\"\",\"\",INDEX('Feed Table'!$C$14:$AJ$177,MATCH(1,(List1[Entry]=$B6)*(List1[AVG-SD]=\"AVG\"),0),M$4))","v":""},{"$f":"IF($B6=\"\",\"\",INDEX('Feed Table'!$C$14:$AJ$177,MATCH(1,(List1[Entry]=$B6)*(List1[AVG-SD]=\"AVG\"),0),N$4))","v":""},{"$f":"+IF(M6=\"forage\",J6,\"-\")","v":"-"},{"$f":"IF($B6=\"\",\"\",INDEX('Feed Table'!$C$14:$AJ$177,MATCH(1,(List1[Entry]=$B6)*(List1[AVG-SD]=\"AVG\"),0),P$4))","v":""},{"$f":"IF($B6=\"\",\"\",INDEX('Feed Table'!$C$14:$AJ$177,MATCH(1,(List1[Entry]=$B6)*(List1[AVG-SD]=\"AVG\"),0),Q$4))","v":""},{"$f":"IF($B6=\"\",\"\",INDEX('Feed Table'!$C$14:$AJ$177,MATCH(1,(List1[Entry]=$B6)*(List1[AVG-SD]=\"AVG\"),0),R$4))","v":""},"",{"$f":"IF($B6=\"\",\"\",INDEX('Feed Table'!$C$14:$AJ$177,MATCH(1,(List1[Entry]=$B6)*(List1[AVG-SD]=\"AVG\"),0),T$4))","v":""},{"$f":"IF($B6=\"\",\"\",INDEX('Feed Table'!$C$14:$AJ$177,MATCH(1,(List1[Entry]=$B6)*(List1[AVG-SD]=\"AVG\"),0),U$4))","v":""},{"$f":"IF($B6=\"\",\"\",INDEX('Feed Table'!$C$14:$AJ$177,MATCH(1,(List1[Entry]=$B6)*(List1[AVG-SD]=\"AVG\"),0),V$4))","v":""},{"$f":"IF($B6=\"\",\"\",INDEX('Feed Table'!$C$14:$AJ$177,MATCH(1,(List1[Entry]=$B6)*(List1[AVG-SD]=\"AVG\"),0),W$4))","v":""},{"$f":"IF($B6=\"\",\"\",INDEX('Feed Table'!$C$14:$AJ$177,MATCH(1,(List1[Entry]=$B6)*(List1[AVG-SD]=\"AVG\"),0),X$4))","v":""},{"$f":"IF($B6=\"\",\"\",IF(AND(M6=\"Forage\",N6>=70),3.362+0.479*'lists to hide'!$E$14-0.007*(1-$O$25)-0.017*R6,IF(M6=\"Forage\",3.054+0.614*'lists to hide'!$E$14,IF(M6=\"Conc\",2.904+1.375*'lists to hide'!$E$14-0.02*(1-$O$25),0))))","v":""},{"$f":"IF($B6=\"\",\"\",INDEX('Feed Table'!$C$14:$AJ$177,MATCH(1,(List1[Entry]=$B6)*(List1[AVG-SD]=\"AVG\"),0),Z$4))","v":""},"","",{"$f":"IF($B6=\"\",\"\",INDEX('Feed Table'!$C$14:$AJ$177,MATCH(1,(List1[Entry]=$B6)*(List1[AVG-SD]=\"AVG\"),0),AC$4))","v":""},{"$f":"IF($B6=\"\",\"\",INDEX('Feed Table'!$C$14:$AJ$177,MATCH(1,(List1[Entry]=$B6)*(List1[AVG-SD]=\"AVG\"),0),AD$4))","v":""},{"$f":"IF($B6=\"\",\"\",INDEX('Feed Table'!$C$14:$AJ$177,MATCH(1,(List1[Entry]=$B6)*(List1[AVG-SD]=\"AVG\"),0),AE$4))","v":""},null,{"$f":"IF($B6=\"\",\"\",INDEX('Feed Table'!$C$14:$AJ$177,MATCH(1,(List1[Entry]=$B6)*(List1[AVG-SD]=\"AVG\"),0),AG$4))","v":""},{"$f":"+IF(AG6=\"\",\"\",AG6*F6)","v":""},{"$f":"IF($B6=\"\",\"\",INDEX('Feed Table'!$C$14:$AK$177,MATCH(1,(List1[Entry]=$B6)*(List1[AVG-SD]=\"AVG\"),0),AI$4))","v":""}]
[null,null,{"$f":"IF($B7=\"\",\"\",INDEX('Feed Table'!$C$14:$AJ$177,MATCH(1,(List1[Entry]=$B7)*(List1[AVG-SD]=\"AVG\"),0),C$4))","v":""},{"$f":"IF($B7=\"\",\"\",INDEX('Feed Table'!$C$14:$AJ$177,MATCH(1,(List1[Entry]=$B7)*(List1[AVG-SD]=\"AVG\"),0),D$4))","v":""},0,0,9.9999999999999995E-7,0,0,0,100,null,{"$f":"IF($B7=\"\",\"\",INDEX('Feed Table'!$C$14:$AJ$177,MATCH(1,(List1[Entry]=$B7)*(List1[AVG-SD]=\"AVG\"),0),M$4))","v":""},{"$f":"IF($B7=\"\",\"\",INDEX('Feed Table'!$C$14:$AJ$177,MATCH(1,(List1[Entry]=$B7)*(List1[AVG-SD]=\"AVG\"),0),N$4))","v":""},"-",{"$f":"IF($B7=\"\",\"\",INDEX('Feed Table'!$C$14:$AJ$177,MATCH(1,(List1[Entry]=$B7)*(List1[AVG-SD]=\"AVG\"),0),P$4))","v":""},{"$f":"IF($B7=\"\",\"\",INDEX('Feed Table'!$C$14:$AJ$177,MATCH(1,(List1[Entry]=$B7)*(List1[AVG-SD]=\"AVG\"),0),Q$4))","v":""},{"$f":"IF($B7=\"\",\"\",INDEX('Feed Table'!$C$14:$AJ$177,MATCH(1,(List1[Entry]=$B7)*(List1[AVG-SD]=\"AVG\"),0),R$4))","v":""},"",{"$f":"IF($B7=\"\",\"\",INDEX('Feed Table'!$C$14:$AJ$177,MATCH(1,(List1[Entry]=$B7)*(List1[AVG-SD]=\"AVG\"),0),T$4))","v":""},{"$f":"IF($B7=\"\",\"\",INDEX('Feed Table'!$C$14:$AJ$177,MATCH(1,(List1[Entry]=$B7)*(List1[AVG-SD]=\"AVG\"),0),U$4))","v":""},{"$f":"IF($B7=\"\",\"\",INDEX('Feed Table'!$C$14:$AJ$177,MATCH(1,(List1[Entry]=$B7)*(List1[AVG-SD]=\"AVG\"),0),V$4))","v":""},{"$f":"IF($B7=\"\",\"\",INDEX('Feed Table'!$C$14:$AJ$177,MATCH(1,(List1[Entry]=$B7)*(List1[AVG-SD]=\"AVG\"),0),W$4))","v":""},{"$f":"IF($B7=\"\",\"\",INDEX('Feed Table'!$C$14:$AJ$177,MATCH(1,(List1[Entry]=$B7)*(List1[AVG-SD]=\"AVG\"),0),X$4))","v":""},{"$f":"IF($B7=\"\",\"\",IF(AND(M7=\"Forage\",N7>=70),3.362+0.479*'lists to hide'!$E$14-0.007*(1-$O$25)-0.017*R7,IF(M7=\"Forage\",3.054+0.614*'lists to hide'!$E$14,IF(M7=\"Conc\",2.904+1.375*'lists to hide'!$E$14-0.02*(1-$O$25),0))))","v":""},{"$f":"IF($B7=\"\",\"\",INDEX('Feed Table'!$C$14:$AJ$177,MATCH(1,(List1[Entry]=$B7)*(List1[AVG-SD]=\"AVG\"),0),Z$4))","v":""},"","",{"$f":"IF($B7=\"\",\"\",INDEX('Feed Table'!$C$14:$AJ$177,MATCH(1,(List1[Entry]=$B7)*(List1[AVG-SD]=\"AVG\"),0),AC$4))","v":""},{"$f":"IF($B7=\"\",\"\",INDEX('Feed Table'!$C$14:$AJ$177,MATCH(1,(List1[Entry]=$B7)*(List1[AVG-SD]=\"AVG\"),0),AD$4))","v":""},{"$f":"IF($B7=\"\",\"\",INDEX('Feed Table'!$C$14:$AJ$177,MATCH(1,(List1[Entry]=$B7)*(List1[AVG-SD]=\"AVG\"),0),AE$4))","v":""},null,{"$f":"IF($B7=\"\",\"\",INDEX('Feed Table'!$C$14:$AJ$177,MATCH(1,(List1[Entry]=$B7)*(List1[AVG-SD]=\"AVG\"),0),AG$4))","v":""},"",{"$f":"IF($B7=\"\",\"\",INDEX('Feed Table'!$C$14:$AK$177,MATCH(1,(List1[Entry]=$B7)*(List1[AVG-SD]=\"AVG\"),0),AI$4))","v":""}]
[null,null,{"$f":"IF($B8=\"\",\"\",INDEX('Feed Table'!$C$14:$AJ$177,MATCH(1,(List1[Entry]=$B8)*(List1[AVG-SD]=\"AVG\"),0),C$4))","v":""},{"$f":"IF($B8=\"\",\"\",INDEX('Feed Table'!$C$14:$AJ$177,MATCH(1,(List1[Entry]=$B8)*(List1[AVG-SD]=\"AVG\"),0),D$4))","v":""},0,0,9.9999999999999995E-7,0,0,0,100,null,{"$f":"IF($B8=\"\",\"\",INDEX('Feed Table'!$C$14:$AJ$177,MATCH(1,(List1[Entry]=$B8)*(List1[AVG-SD]=\"AVG\"),0),M$4))","v":""},{"$f":"IF($B8=\"\",\"\",INDEX('Feed Table'!$C$14:$AJ$177,MATCH(1,(List1[Entry]=$B8)*(List1[AVG-SD]=\"AVG\"),0),N$4))","v":""},"-",{"$f":"IF($B8=\"\",\"\",INDEX('Feed Table'!$C$14:$AJ$177,MATCH(1,(List1[Entry]=$B8)*(List1[AVG-SD]=\"AVG\"),0),P$4))","v":""},{"$f":"IF($B8=\"\",\"\",INDEX('Feed Table'!$C$14:$AJ$177,MATCH(1,(List1[Entry]=$B8)*(List1[AVG-SD]=\"AVG\"),0),Q$4))","v":""},{"$f":"IF($B8=\"\",\"\",INDEX('Feed Table'!$C$14:$AJ$177,MATCH(1,(List1[Entry]=$B8)*(List1[AVG-SD]=\"AVG\"),0),R$4))","v":""},"",{"$f":"IF($B8=\"\",\"\",INDEX('Feed Table'!$C$14:$AJ$177,MATCH(1,(List1[Entry]=$B8)*(List1[AVG-SD]=\"AVG\"),0),T$4))","v":""},{"$f":"IF($B8=\"\",\"\",INDEX('Feed Table'!$C$14:$AJ$177,MATCH(1,(List1[Entry]=$B8)*(List1[AVG-SD]=\"AVG\"),0),U$4))","v":""},{"$f":"IF($B8=\"\",\"\",INDEX('Feed Table'!$C$14:$AJ$177,MATCH(1,(List1[Entry]=$B8)*(List1[AVG-SD]=\"AVG\"),0),V$4))","v":""},{"$f":"IF($B8=\"\",\"\",INDEX('Feed Table'!$C$14:$AJ$177,MATCH(1,(List1[Entry]=$B8)*(List1[AVG-SD]=\"AVG\"),0),W$4))","v":""},{"$f":"IF($B8=\"\",\"\",INDEX('Feed Table'!$C$14:$AJ$177,MATCH(1,(List1[Entry]=$B8)*(List1[AVG-SD]=\"AVG\"),0),X$4))","v":""},{"$f":"IF($B8=\"\",\"\",IF(AND(M8=\"Forage\",N8>=70),3.362+0.479*'lists to hide'!$E$14-0.007*(1-$O$25)-0.017*R8,IF(M8=\"Forage\",3.054+0.614*'lists to hide'!$E$14,IF(M8=\"Conc\",2.904+1.375*'lists to hide'!$E$14-0.02*(1-$O$25),0))))","v":""},{"$f":"IF($B8=\"\",\"\",INDEX('Feed Table'!$C$14:$AJ$177,MATCH(1,(List1[Entry]=$B8)*(List1[AVG-SD]=\"AVG\"),0),Z$4))","v":""},"","",{"$f":"IF($B8=\"\",\"\",INDEX('Feed Table'!$C$14:$AJ$177,MATCH(1,(List1[Entry]=$B8)*(List1[AVG-SD]=\"AVG\"),0),AC$4))","v":""},{"$f":"IF($B8=\"\",\"\",INDEX('Feed Table'!$C$14:$AJ$177,MATCH(1,(List1[Entry]=$B8)*(List1[AVG-SD]=\"AVG\"),0),AD$4))","v":""},{"$f":"IF($B8=\"\",\"\",INDEX('Feed Table'!$C$14:$AJ$177,MATCH(1,(List1[Entry]=$B8)*(List1[AVG-SD]=\"AVG\"),0),AE$4))","v":""},null,{"$f":"IF($B8=\"\",\"\",INDEX('Feed Table'!$C$14:$AJ$177,MATCH(1,(List1[Entry]=$B8)*(List1[AVG-SD]=\"AVG\"),0),AG$4))","v":""},"",{"$f":"IF($B8=\"\",\"\",INDEX('Feed Table'!$C$14:$AK$177,MATCH(1,(List1[Entry]=$B8)*(List1[AVG-SD]=\"AVG\"),0),AI$4))","v":""}]
[null,null,{"$f":"IF($B9=\"\",\"\",INDEX('Feed Table'!$C$14:$AJ$177,MATCH(1,(List1[Entry]=$B9)*(List1[AVG-SD]=\"AVG\"),0),C$4))","v":""},{"$f":"IF($B9=\"\",\"\",INDEX('Feed Table'!$C$14:$AJ$177,MATCH(1,(List1[Entry]=$B9)*(List1[AVG-SD]=\"AVG\"),0),D$4))","v":""},0,0,9.9999999999999995E-7,0,0,0,100,null,{"$f":"IF($B9=\"\",\"\",INDEX('Feed Table'!$C$14:$AJ$177,MATCH(1,(List1[Entry]=$B9)*(List1[AVG-SD]=\"AVG\"),0),M$4))","v":""},{"$f":"IF($B9=\"\",\"\",INDEX('Feed Table'!$C$14:$AJ$177,MATCH(1,(List1[Entry]=$B9)*(List1[AVG-SD]=\"AVG\"),0),N$4))","v":""},"-",{"$f":"IF($B9=\"\",\"\",INDEX('Feed Table'!$C$14:$AJ$177,MATCH(1,(List1[Entry]=$B9)*(List1[AVG-SD]=\"AVG\"),0),P$4))","v":""},{"$f":"IF($B9=\"\",\"\",INDEX('Feed Table'!$C$14:$AJ$177,MATCH(1,(List1[Entry]=$B9)*(List1[AVG-SD]=\"AVG\"),0),Q$4))","v":""},{"$f":"IF($B9=\"\",\"\",INDEX('Feed Table'!$C$14:$AJ$177,MATCH(1,(List1[Entry]=$B9)*(List1[AVG-SD]=\"AVG\"),0),R$4))","v":""},"",{"$f":"IF($B9=\"\",\"\",INDEX('Feed Table'!$C$14:$AJ$177,MATCH(1,(List1[Entry]=$B9)*(List1[AVG-SD]=\"AVG\"),0),T$4))","v":""},{"$f":"IF($B9=\"\",\"\",INDEX('Feed Table'!$C$14:$AJ$177,MATCH(1,(List1[Entry]=$B9)*(List1[AVG-SD]=\"AVG\"),0),U$4))","v":""},{"$f":"IF($B9=\"\",\"\",INDEX('Feed Table'!$C$14:$AJ$177,MATCH(1,(List1[Entry]=$B9)*(List1[AVG-SD]=\"AVG\"),0),V$4))","v":""},{"$f":"IF($B9=\"\",\"\",INDEX('Feed Table'!$C$14:$AJ$177,MATCH(1,(List1[Entry]=$B9)*(List1[AVG-SD]=\"AVG\"),0),W$4))","v":""},{"$f":"IF($B9=\"\",\"\",INDEX('Feed Table'!$C$14:$AJ$177,MATCH(1,(List1[Entry]=$B9)*(List1[AVG-SD]=\"AVG\"),0),X$4))","v":""},{"$f":"IF($B9=\"\",\"\",IF(AND(M9=\"Forage\",N9>=70),3.362+0.479*'lists to hide'!$E$14-0.007*(1-$O$25)-0.017*R9,IF(M9=\"Forage\",3.054+0.614*'lists to hide'!$E$14,IF(M9=\"Conc\",2.904+1.375*'lists to hide'!$E$14-0.02*(1-$O$25),0))))","v":""},{"$f":"IF($B9=\"\",\"\",INDEX('Feed Table'!$C$14:$AJ$177,MATCH(1,(List1[Entry]=$B9)*(List1[AVG-SD]=\"AVG\"),0),Z$4))","v":""},"","",{"$f":"IF($B9=\"\",\"\",INDEX('Feed Table'!$C$14:$AJ$177,MATCH(1,(List1[Entry]=$B9)*(List1[AVG-SD]=\"AVG\"),0),AC$4))","v":""},{"$f":"IF($B9=\"\",\"\",INDEX('Feed Table'!$C$14:$AJ$177,MATCH(1,(List1[Entry]=$B9)*(List1[AVG-SD]=\"AVG\"),0),AD$4))","v":""},{"$f":"IF($B9=\"\",\"\",INDEX('Feed Table'!$C$14:$AJ$177,MATCH(1,(List1[Entry]=$B9)*(List1[AVG-SD]=\"AVG\"),0),AE$4))","v":""},null,{"$f":"IF($B9=\"\",\"\",INDEX('Feed Table'!$C$14:$AJ$177,MATCH(1,(List1[Entry]=$B9)*(List1[AVG-SD]=\"AVG\"),0),AG$4))","v":""},"",{"$f":"IF($B9=\"\",\"\",INDEX('Feed Table'!$C$14:$AK$177,MATCH(1,(List1[Entry]=$B9)*(List1[AVG-SD]=\"AVG\"),0),AI$4))","v":""}]
[null,null,{"$f":"IF($B10=\"\",\"\",INDEX('Feed Table'!$C$14:$AJ$177,MATCH(1,(List1[Entry]=$B10)*(List1[AVG-SD]=\"AVG\"),0),C$4))","v":""},{"$f":"IF($B10=\"\",\"\",INDEX('Feed Table'!$C$14:$AJ$177,MATCH(1,(List1[Entry]=$B10)*(List1[AVG-SD]=\"AVG\"),0),D$4))","v":""},0,0,9.9999999999999995E-7,0,0,0,100,null,{"$f":"IF($B10=\"\",\"\",INDEX('Feed Table'!$C$14:$AJ$177,MATCH(1,(List1[Entry]=$B10)*(List1[AVG-SD]=\"AVG\"),0),M$4))","v":""},{"$f":"IF($B10=\"\",\"\",INDEX('Feed Table'!$C$14:$AJ$177,MATCH(1,(List1[Entry]=$B10)*(List1[AVG-SD]=\"AVG\"),0),N$4))","v":""},"-",{"$f":"IF($B10=\"\",\"\",INDEX('Feed Table'!$C$14:$AJ$177,MATCH(1,(List1[Entry]=$B10)*(List1[AVG-SD]=\"AVG\"),0),P$4))","v":""},{"$f":"IF($B10=\"\",\"\",INDEX('Feed Table'!$C$14:$AJ$177,MATCH(1,(List1[Entry]=$B10)*(List1[AVG-SD]=\"AVG\"),0),Q$4))","v":""},{"$f":"IF($B10=\"\",\"\",INDEX('Feed Table'!$C$14:$AJ$177,MATCH(1,(List1[Entry]=$B10)*(List1[AVG-SD]=\"AVG\"),0),R$4))","v":""},"",{"$f":"IF($B10=\"\",\"\",INDEX('Feed Table'!$C$14:$AJ$177,MATCH(1,(List1[Entry]=$B10)*(List1[AVG-SD]=\"AVG\"),0),T$4))","v":""},{"$f":"IF($B10=\"\",\"\",INDEX('Feed Table'!$C$14:$AJ$177,MATCH(1,(List1[Entry]=$B10)*(List1[AVG-SD]=\"AVG\"),0),U$4))","v":""},{"$f":"IF($B10=\"\",\"\",INDEX('Feed Table'!$C$14:$AJ$177,MATCH(1,(List1[Entry]=$B10)*(List1[AVG-SD]=\"AVG\"),0),V$4))","v":""},{"$f":"IF($B10=\"\",\"\",INDEX('Feed Table'!$C$14:$AJ$177,MATCH(1,(List1[Entry]=$B10)*(List1[AVG-SD]=\"AVG\"),0),W$4))","v":""},{"$f":"IF($B10=\"\",\"\",INDEX('Feed Table'!$C$14:$AJ$177,MATCH(1,(List1[Entry]=$B10)*(List1[AVG-SD]=\"AVG\"),0),X$4))","v":""},{"$f":"IF($B10=\"\",\"\",IF(AND(M10=\"Forage\",N10>=70),3.362+0.479*'lists to hide'!$E$14-0.007*(1-$O$25)-0.017*R10,IF(M10=\"Forage\",3.054+0.614*'lists to hide'!$E$14,IF(M10=\"Conc\",2.904+1.375*'lists to hide'!$E$14-0.02*(1-$O$25),0))))","v":""},{"$f":"IF($B10=\"\",\"\",INDEX('Feed Table'!$C$14:$AJ$177,MATCH(1,(List1[Entry]=$B10)*(List1[AVG-SD]=\"AVG\"),0),Z$4))","v":""},"","",{"$f":"IF($B10=\"\",\"\",INDEX('Feed Table'!$C$14:$AJ$177,MATCH(1,(List1[Entry]=$B10)*(List1[AVG-SD]=\"AVG\"),0),AC$4))","v":""},{"$f":"IF($B10=\"\",\"\",INDEX('Feed Table'!$C$14:$AJ$177,MATCH(1,(List1[Entry]=$B10)*(List1[AVG-SD]=\"AVG\"),0),AD$4))","v":""},{"$f":"IF($B10=\"\",\"\",INDEX('Feed Table'!$C$14:$AJ$177,MATCH(1,(List1[Entry]=$B10)*(List1[AVG-SD]=\"AVG\"),0),AE$4))","v":""},null,{"$f":"IF($B10=\"\",\"\",INDEX('Feed Table'!$C$14:$AJ$177,MATCH(1,(List1[Entry]=$B10)*(List1[AVG-SD]=\"AVG\"),0),AG$4))","v":""},"",{"$f":"IF($B10=\"\",\"\",INDEX('Feed Table'!$C$14:$AK$177,MATCH(1,(List1[Entry]=$B10)*(List1[AVG-SD]=\"AVG\"),0),AI$4))","v":""}]
{"$rows_left_out":31}
{"sheet":"Ration Guidlines","index":5,"n_rows":27,"n_cols":38,"rows_kept":27,"cut":false,"hidden":true,"merged":[[12,1,12,2],[15,1,15,2],[0,4,1,4],[0,6,1,6]]}
[null,null,null,null," Lower limit Diet DM, %",null,"Higher Limit Diet DM, %",null,null,"%forage","% \"as-is\"",null,null,null,"% of the dry matter (DM) in the feed from Lab. Analysis",null,null,null,null,null,"% of DM",null,"% of DM","%","% of CP","% of CP","% of CP","%/h",null,"%","% of CP","% of CP","% of DM","% of DM","% of CP","% of CP"]
[null,"Enter feed number here","Kg of DM fed","Lbs of DM fed",null," Diet DM, %",null,"Name","Description","TDN eq. Cl.","DM","CP","NDICP ","ADICP","EE","NDF","Forage NDF","ADF","Lig.","Ash","NFC","PAF","Hcel","TDN 1x","A","B","C","B Frc. Kd","B frc. Kp","RUP Dig","RDP","RUP","RDP","RUP","Lys2","Met2","Ca","P"]
[]
[]
[null,"Ration guidelines"]
[]
[null,"Early / Dry Period"]
[null,"lower limit",null,null,null,null,null,null,null,null,null,10.8,null,null,null,33,21,null,null,null,0,null,null,null,null,null,null,null,null,null,null,null,8.6999999999999993,2.1,null,null,0.45,0.23]
[null,"higher limit",null,null,null,null,null,null,null,null,null,10.8,null,null,null,100,100,null,null,null,42,null,null,null,null,null,null,null,null,null,null,null,8.6999999999999993,2.1,null,null,0.45,0.23]
[null,"pre-calviing"]
{"$rows_left_out":18}
{"sheet":"lists to hide","index":6,"n_rows":21,"n_cols":5,"rows_kept":21,"cut":false,"hidden":true,"merged":[]}
[null,"breed ",null,"type "]
[null,"Holstein",null,"Heifer"]
[null,"Ayrshire",null,"Lactating cow"]
[null,"Brown Swiss",null,"Dry cow/ late lactating heifer"]
[null,"Guernsey"]
[null,"Holstein",null,"Cow stage"]
[null,"Jersey",null,"Fresh cow"]
[null,"Large Breed ",null,"Early lactation cow"]
[null,"Midsize breed",null,"mid lactation cow"]
[null,"small breed",null,"Late lactation cow"]
{"$rows_left_out":12}
{"sheet":"diets with the feed analysi (2","index":7,"n_rows":81,"n_cols":43,"rows_kept":81,"cut":false,"hidden":true,"merged":[[2,23,2,29],[2,31,2,37],[2,40,2,42],[4,13,4,21],[4,23,4,29],[4,31,4,37],[4,40,4,42]]}
[]
[null,"Assumed DMI:",25,"kg/d"]
[null,null,null,null,null,null,null,null,null,null,null,null,null,"FEED INGREDIENT COMPOSITION (NRC & Other Sources)",null,null,null,null,null,null,null,null,null,"Macro-Mineral Ingredient composition (NRC)",null,null,null,null,null,null,null,"Micro-Mineral Ingredient composition (NRC)",null,null,null,null,null,null,null,null,"Vitamins Ingredient composition (NRC)"]
["Name","Description","TDN eq. Cl.","AVG-SD","DM","CP","NDICP ","ADICP","EE","NDF","ADF","Lig.","Ash","NFC","PAF","Hcel","TDN 1x","A","B","C","B Frc. Kd","RUP Dig","Lys2","Met2","Ca","P","Mg","K","Na","Cl","S","Co","Cu","I","Fe","Mn","Se","Zn","Mb",null,"VitA","VitD","VitE"]
[null,null,"FORAGE",{"$f":"SUM(D6:D7)","v":55},{"$f":"SUM(E6:E7)","v":62},{"$f":"SUM(F6:F7)","v":69},{"$f":"SUM(G6:G7)","v":76},{"$f":"D5","v":55},{"$f":"E5","v":62},null,{"$f":"D5","v":55},{"$f":"E5","v":62},null,"% of DM",null,null,null,null,null,null,null,null,null,"% of DM",null,null,null,null,null,null,null,"mg/Kg",null,null,null,null,null,null,null,null,"1000 IU/Kg"]
[1,"Corn silage",null,27.5,31,34.5,38,{"$f":"(D6*($C$2/100)*$V6)/$C$2","v":1.8975},{"$f":"(E6*($C$2/100)*$V6)/$C$2","v":2.1390000000000002},null,{"$f":"H6*100/$H$18","v":12.195043574384945},{"$f":"I6*100/$I$18","v":13.708902134204964},null,41.4,3.3,36.200000000000003,{"$f":"P6-18","v":18.200000000000003},49.9,2.5499999999999998,4.0999999999999996,38.200000000000003,6.9,null,0.25,0.18,0.17,0.28999999999999998,0.67,0.01,0.11,null,0,5.7,0,104,36,0.04,24,null,null,0,0,0]
[2,"Alfalfa silage",null,27.5,31,34.5,38,{"$f":"(D7*($C$2/100)*V7)/$C$2","v":6.4625000000000004},{"$f":"(E7*($C$2/100)*$V7)/$C$2","v":7.2850000000000001},null,41.533844057687858,{"$f":"I7*100/$I$18","v":46.689739152727043},null,33.9,3.5,37,{"$f":"P7-8","v":29},26.6,6.35,10.5,1.2,23.5,null,1.26,0.28999999999999998,0.24,0.48,2.5099999999999998,0.02,0.28000000000000003,null,0.65,9,0,403,63,0.18,29,null,null,0,0,0]
[3,"Wheat straw",null,0,0,0,0,0,0,null,0,0]
[4,"HMC",null,26.75,20,13.25,6.5,2.4396,1.8239999999999998,null,15.679066299904882,11.690059603922322,null,71.8,4.57,5.55,1.27,{"$f":"100-T9-O9-P9-V9","v":79.11999999999999},0.01,1.64,72,9.1199999999999992,null,0.03,0.3,0.12,0.05,0.43,0.01,0.1,null,0,1,0,59,7,7.0000000000000007E-2,21,null,null,0,0,0]
[5,"Beet sugar pulp",null,0,0,0,0,0,0,null,0,0,null,88.3,0.3,45.8,23.1,37.800000000000011,1.6,7.3,3.3,8.8000000000000007,null,0.6,0.1,0.23,0.18,0.96,0.31,0.3,null,0,11,0,642,62,0.14000000000000001,22,null,null,0,0,0]
{"$rows_left_out":71}